Clarity PPM

Expand all | Collapse all

Java Error while installing clarity 14.2

Jump to Best Answer
  • 1.  Java Error while installing clarity 14.2

    Posted 07-29-2016 02:26 AM

    Hi All,

    I am trying to install 14.2 on linux 64 machine and facing below error .

    Could you please advise where I am wrong here .Seems this is java related error .

    I have set the java home and java version is 1.7.

     

    checkinstall:   (During prechecks )

    BUILD FAILED

    /home/oracle/install/checkinstall/gateway.xml:22: The following error occurred while executing this line:

    /home/oracle/install/checkinstall/checkinstall.xml:173: java.lang.NoSuchFieldError: level

      at org.apache.log4j.spi.RootLogger.setLevel(RootLogger.java:65)

    BUILD FAILED -: (while running install.sh )

    /home/oracle/install/gateway.xml:34: The following error occurred while executing this line:

    /home/oracle/install/install.xml:115: java.lang.NoSuchFieldError: level.

     

    Many thanks in advance.

     

    Regards,

    Udaya K



  • 2.  Re: Java Error while installing clarity 14.2

    Posted 07-29-2016 02:57 AM

    Hi Udaya,

     

    Can you please share the install.log please.

     

    Regards

    Suman Pramanik



  • 3.  Re: Java Error while installing clarity 14.2

    Posted 07-29-2016 04:21 AM

    Hi Suman,

    Installation not started due to this error and no logs were generated .Nothing is available in install.log file.

    I am not getting what is the error.can you please suggest me if anything I need to cross verify before start installation.

    Many thanks.

     

    Regards,

    Udaya K



  • 4.  Re: Java Error while installing clarity 14.2

    Posted 07-29-2016 05:18 AM

    What is displayed on the screen after you give the install command?

    Run the separate checkinstall to see if there is something missing in the environment setup.



  • 5.  Re: Java Error while installing clarity 14.2

    Posted 07-29-2016 04:59 PM

    Hi Urmas,

    Please find the below error details for checkinstall and install cmd .

     

    [oracle@caclarityppm checkinstall]$ sh checkinstall.sh

    Buildfile: /home/oracle/install/checkinstall/gateway.xml

    gateway:

    init:

    checkinstall:

    BUILD FAILED

    /home/oracle/install/checkinstall/gateway.xml:22: The following error occurred while executing this line:

    /home/oracle/install/checkinstall/checkinstall.xml:173: java.lang.NoSuchFieldError: level

      at org.apache.log4j.spi.RootLogger.setLevel(RootLogger.java:65)

      at org.apache.log4j.spi.RootLogger.<init>(RootLogger.java:44)

      at org.apache.log4j.LogManager.<clinit>(LogManager.java:78)

      at org.apache.log4j.Logger.getLogger(Logger.java:104)

      at com.niku.tools.taskdefs.Log4jListener.<init>(TimestampRecorder.java:254)

      at com.niku.tools.taskdefs.Log4jOut.<init>(TimestampRecorder.java:185)

      at com.niku.tools.taskdefs.TimestampRecorder.execute(TimestampRecorder.java:110)

      at org.apache.tools.ant.UnknownElement.execute(UnknownElement.java:291)

      at sun.reflect.GeneratedMethodAccessor4.invoke(Unknown Source)

    (......)

    [oracle@caclarityppm checkinstall]$ sh checkinstall.sh

    Buildfile: /home/oracle/install/checkinstall/gateway.xml

    gateway:

    init:

    checkinstall:

    BUILD FAILED

    /home/oracle/install/checkinstall/gateway.xml:22: The following error occurred while executing this line:

    /home/oracle/install/checkinstall/checkinstall.xml:173: java.lang.NoSuchFieldError: level

      at org.apache.log4j.spi.RootLogger.setLevel(RootLogger.java:65)

      at org.apache.log4j.spi.RootLogger.<init>(RootLogger.java:44)

      at org.apache.log4j.LogManager.<clinit>(LogManager.java:78)

      at org.apache.log4j.Logger.getLogger(Logger.java:104)

      at com.niku.tools.taskdefs.Log4jListener.<init>(TimestampRecorder.java:254)

      at com.niku.tools.taskdefs.Log4jOut.<init>(TimestampRecorder.java:185)

      at com.niku.tools.taskdefs.TimestampRecorder.execute(TimestampRecorder.java:110)

      at org.apache.tools.ant.UnknownElement.execute(UnknownElement.java:291)

      at sun.reflect.GeneratedMethodAccessor4.invoke(Unknown Source)

    (.....)

     

    Regards,

    Udaya K



  • 6.  Re: Java Error while installing clarity 14.2

    Posted 08-01-2016 02:04 AM

    Hi Udaya,

     

    From the error it looks like your third party tools and path variable set up is not correctly done. Can you test the java path.

     

    Regards

    Suman Pramanik



  • 7.  Re: Java Error while installing clarity 14.2

    Posted 08-01-2016 03:25 AM

    Hi Suman,

     

    Not sure how to cross verify , below is the details of path and JAVA_HOME.

    Can you please advise on the next step .

    [oracle@caclarityppm ~]$ echo $PATH

    /usr/java/jdk1.7.0_67/bin:/usr/java/jdk1.7.0_67/jre/bin:/usr/sbin:(.....)

     

    [oracle@caclarityppm ~]$ java -version

    java version "1.7.0_67"

    Java(TM) SE Runtime Environment (build 1.7.0_67-b01)

    Java HotSpot(TM) 64-Bit Server VM (build 24.65-b04, mixed mode)

    [oracle@caclarityppm ~]$ which java

    /usr/java/jdk1.7.0_67/bin/java

    [oracle@caclarityppm ~]$ env | grep 'HOME'

    JRE_HOME=/usr/java/jdk1.7.0_67/jre

    JAVA_HOME=/usr/java/jdk1.7.0_67

    [oracle@caclarityppm ~]$ uname -a

    Linux caclarityppm 3.10.0-327.22.2.el7.x86_64 #1 SMP Thu Jun 23 17:05:11 UTC 2016 x86_64 x86_64 x86_64

     

    Regards,

    Udaya K



  • 8.  Re: Java Error while installing clarity 14.2
    Best Answer

    Posted 08-01-2016 09:53 AM

    Hi Udaya,

     

    It looks perfectly ok, I would say at this point raise a support case so that we can see your environment and troubleshoot.


    Regards

    Suman Pramanik



  • 9.  Re: Java Error while installing clarity 14.2

    Posted 08-05-2016 08:10 AM

    Hi Suman,

     

    Not sure what SA did , it worked and were able to install.

     

    Regards,

    Udaya K



  • 10.  Re: Java Error while installing clarity 14.2

    Posted 08-05-2016 11:52 AM

    Hi Udaya,

     

    Glad to hear, I think you meant CA and not SA.

     

    Regards

    Suman Pramanik